Reaction Details
TargetProstacyclin receptor
LigandBDBM82094
Substrate/Competitorn/a
Ki 4370±n/a nM
CommentsPDSP_1464
Citation Blair, IAMacDermot, J The binding of [3H]-prostacyclin to membranes of a neuronal somatic hybrid. Br J Pharmacol72:435-41 (1981) 
 
Prostacyclin receptor
Name:Prostacyclin receptor
Type:G Protein-Coupled Receptor (GPCR)
Mol. Mass.:40968.22
Organism:Homo sapiens (Human)
Description:The membranes prepared from human platelet were used in binding assay.
Residue:386
BDBM82094
NameBDBM82094
Synonyms:17-PHENYL TRINOR PROSTAGLANDIN E2 PGE2,17-Phenyl
TypeSmall organic molecule
Emp. Form.C23H30O5
Mol. Mass.386.4813
SMILESO[C@@H](CCc1ccccc1)\C=C\[C@H]1[C@H](O)CC(=O)[C@@H]1C\C=C/CCCC(O)=O