Reaction Details
TargetProstacyclin receptor
LigandBDBM82096
Substrate/Competitorn/a
Ki>10000±n/a nM
CommentsPDSP_5311
Citation Blair, IAMacDermot, J The binding of [3H]-prostacyclin to membranes of a neuronal somatic hybrid. Br J Pharmacol72:435-41 (1981) 
 
Prostacyclin receptor
Name:Prostacyclin receptor
Type:G Protein-Coupled Receptor (GPCR)
Mol. Mass.:40968.22
Organism:Homo sapiens (Human)
Description:The membranes prepared from human platelet were used in binding assay.
Residue:386
BDBM82096
NameBDBM82096
Synonyms:2,3-dinor-6-ketoprostaglandin F1alpha PGF1alpha, 6-oxo
TypeSmall organic molecule
Emp. Form.C18H30O6
Mol. Mass.342.4272
SMILESCCCCC[C@H](O)\C=C\[C@H]1[C@H](O)C[C@H](O)[C@@H]1CC(=O)CCC(O)=O