Reaction Details
TargetCarbonic anhydrase 4
LigandBDBM82104
Substrate/Competitorn/a
Meas. Tech.Inhibition Assay
pH7.5±0
Temperature293.15±0 K
Ki 30±0.0 nM
Citation De Simone, GScozzafava, ASupuran, CT Which carbonic anhydrases are targeted by the antiepileptic sulfonamides and sulfamates? Chem Biol Drug Des74:317-21 (2009) 
 
Carbonic anhydrase 4
Name:Carbonic anhydrase 4
Type:Enzyme
Mol. Mass.:35037.98
Organism:Homo sapiens (Human)
Description:P22748
Residue:312
BDBM82104
NameBDBM82104
Synonyms:Investigational agent, 5
TypeSmall organic molecule
Emp. Form.C13H19N5O3S2
Mol. Mass.357.452
SMILESNS(=O)(=O)c1nnc(NC(=O)N[C@]23C[C@H]4C[C@H](C[C@H](C4)C2)C3)s1