Reaction Details
TargetDihydrofolate reductase
LigandBDBM82110
Substrate/Competitorn/a
Meas. Tech.Inhibition Assay
IC50 14.9±0.0 nM
Citation Ma, XWoon, RSHo, PCChui, WK Antiproliferative activity against MCF-7 breast cancer cells by diamino-triazaspirodiene antifolates. Chem Biol Drug Des74:322-6 (2009) 
 
Dihydrofolate reductase
Name:Dihydrofolate reductase
Type:Enzyme
Mol. Mass.:21603.71
Organism:Bos taurus (Cattle)
Description:P00376
Residue:187
BDBM82110
NameBDBM82110
Synonyms:6,8,10-Traiazaspiro[4.5]deca-6,8-diene-7,9-diamine, If
TypeSmall organic molecule
Emp. Form.C17H26N6O
Mol. Mass.330.4279
SMILESCN(CCCON1C(N)=NC(N)=NC11CCCC1)c1ccccc1