Reaction Details
TargetDihydrofolate reductase
LigandBDBM82117
Substrate/Competitorn/a
Meas. Tech.Inhibition Assay
IC50 41.4±0.0 nM
Citation Ma, XWoon, RSHo, PCChui, WK Antiproliferative activity against MCF-7 breast cancer cells by diamino-triazaspirodiene antifolates. Chem Biol Drug Des74:322-6 (2009) 
 
Dihydrofolate reductase
Name:Dihydrofolate reductase
Type:Enzyme
Mol. Mass.:21603.71
Organism:Bos taurus (Cattle)
Description:P00376
Residue:187
BDBM82117
NameBDBM82117
Synonyms:1,3,5-Triazaspiro[5.5]undeca-1,3-diene-2,4-diamine, IIf
TypeSmall organic molecule
Emp. Form.C18H28N6O
Mol. Mass.344.4545
SMILESCN(CCCON1C(N)=NC(N)=NC11CCCCC1)c1ccccc1