Reaction Details
TargetP2X purinoceptor 3
LigandBDBM271518
Substrate/Competitorn/a
Meas. Tech.Rat P2X3 Binding Assay in Rat Serum Albumin (HSA)
IC50 11.0±n/a nM
Citation Kai, H Aminotriazine derivative and pharmaceutical composition comprising the same US Patent US10065941 Publication Date 9/4/2018
 
P2X purinoceptor 3
Name:P2X purinoceptor 3
Type:Enzyme Catalytic Domain
Mol. Mass.:44397.63
Organism:RAT
Description:Purinergic, P2X3 0 RAT::P49654
Residue:397
BDBM271518
NameBDBM271518
Synonyms:US10065941, Compound I-019 | US9732060, Compound I-019
TypeSmall organic molecule
Emp. Form.C26H21ClFN5O5
Mol. Mass.537.927
SMILESOC(=O)[C@H]1C[C@@H](C1)n1c(=O)[nH]\c(=N/c2ccc(Oc3ccc(F)cn3)cc2)n(Cc2ccc(Cl)cc2)c1=O