Reaction Details
TargetP2X purinoceptor 3
LigandBDBM271675
Substrate/Competitorn/a
Meas. Tech.Rat P2X3 Binding Assay in Rat Serum Albumin (HSA)
IC50 6.00±n/a nM
Citation Kai, H Aminotriazine derivative and pharmaceutical composition comprising the same US Patent US10065941 Publication Date 9/4/2018
 
P2X purinoceptor 3
Name:P2X purinoceptor 3
Type:Enzyme Catalytic Domain
Mol. Mass.:44397.63
Organism:RAT
Description:Purinergic, P2X3 0 RAT::P49654
Residue:397
BDBM271675
NameBDBM271675
Synonyms:US10065941, Compound R-014 | US9732060, Compound R-014
TypeSmall organic molecule
Emp. Form.C24H20Cl2N6O5
Mol. Mass.543.359
SMILESC[C@@H](Cn1c(=O)[nH]\c(=N/c2ccc(Oc3cnc(Cl)cn3)cc2)n(Cc2ccc(Cl)cc2)c1=O)C(O)=O