Reaction Details
TargetCarbonic anhydrase 6
LigandBDBM50137677
Substrate/Competitorn/a
Meas. Tech.Enzyme Inhbition Assay
pH7.5±0
Temperature293.15±0 K
Ki 34.1±0 nM
Citation Winum, JYMontero, JLVullo, DSupuran, CT Carbonic anhydrase inhibitors: glycosylsulfanilamides act as subnanomolar inhibitors of the human secreted isoform VI. Chem Biol Drug Des74:636-9 (2009) 
 
Carbonic anhydrase 6
Name:Carbonic anhydrase 6
Type:Enzyme
Mol. Mass.:35371.40
Organism:Homo sapiens (Human)
Description:P23280
Residue:308
BDBM50137677
NameBDBM50137677
Synonyms:4-(3,4,5-Trihydroxy-6-hydroxymethyl-tetrahydro-pyran-2-ylamino)-benzenesulfonamide N-(p-sulfamoylphenyl)-alpha-glycopyranosylamine, 1 N-(p-sulfamoylphenyl)-alpha-glycopyranosylamine, 3
TypeSmall organic molecule
Emp. Form.C12H18N2O7S
Mol. Mass.334.346
SMILESNS(=O)(=O)c1ccc(NC2OC(CO)C(O)C(O)C2O)cc1