Reaction Details
TargetEndoplasmic reticulum chaperone BiP
LigandBDBM82126
Substrate/Competitorn/a
Meas. Tech.SPR assay
pH7.4±0
Temperature298.15±0 K
Kd 4.36e+3±n/a nM
KOFF>1 s-1
Citation Macias, ATWilliamson, DSAllen, NBorgognoni, JClay, ADaniels, ZDokurno, PDrysdale, MJFrancis, GLGraham, CJHowes, RMatassova, NMurray, JBParsons, RShaw, TSurgenor, AETerry, LWang, YWood, MMassey, AJ Adenosine-derived inhibitors of 78 kDa glucose regulated protein (Grp78) ATPase: insights into isoform selectivity. J Med Chem54:4034-41 (2011) 
 
Endoplasmic reticulum chaperone BiP
Name:Endoplasmic reticulum chaperone BiP
Type:n/a
Mol. Mass.:72312.92
Organism:Homo sapiens (Human)
Description:P11021
Residue:654
BDBM82126
NameBDBM82126
Synonyms:(2R,3R,4S,5R)-2-(6-Amino-8-methylaminopurin-9-yl)-5- cyclohexylmethoxymethyltetrahydrofuran-3,4-diol | adenosine-derived inhibitor (Grp78), 5
TypeSmall organic molecule
Emp. Form.C18H28N6O4
Mol. Mass.392.4527
SMILESCNc1nc2c(N)ncnc2n1[C@@H]1O[C@H](COCC2CCCCC2)[C@@H](O)[C@H]1O