Reaction Details
TargetEndoplasmic reticulum chaperone BiP
LigandBDBM82128
Substrate/Competitorn/a
Meas. Tech.SPR assay
pH7.4±0
Temperature298.15±0 K
Kd 1.236e+4±n/a nM
KOFF>1 s-1
Citation Macias, ATWilliamson, DSAllen, NBorgognoni, JClay, ADaniels, ZDokurno, PDrysdale, MJFrancis, GLGraham, CJHowes, RMatassova, NMurray, JBParsons, RShaw, TSurgenor, AETerry, LWang, YWood, MMassey, AJ Adenosine-derived inhibitors of 78 kDa glucose regulated protein (Grp78) ATPase: insights into isoform selectivity. J Med Chem54:4034-41 (2011) 
 
Endoplasmic reticulum chaperone BiP
Name:Endoplasmic reticulum chaperone BiP
Type:n/a
Mol. Mass.:72312.92
Organism:Homo sapiens (Human)
Description:P11021
Residue:654
BDBM82128
NameBDBM82128
Synonyms:2-[(2R,3S,4R,5R)-5-(6-Amino-8-methylaminopurin-9-yl)- 3,4-dihydroxytetrahydrofuran-2-ylmethoxy]acetamide | adenosine-derived inhibitor (Grp78), 7
TypeSmall organic molecule
Emp. Form.C13H19N7O5
Mol. Mass.353.3339
SMILESCNc1nc2c(N)ncnc2n1[C@@H]1O[C@H](COCC(N)=O)[C@@H](O)[C@H]1O