Reaction Details
TargetHeat shock 70 kDa protein 1A
LigandBDBM82126
Substrate/Competitorn/a
Meas. Tech.Fluorescence-Polarization (FP) Binding Assay
pH7.4±0
Temperature298.15±0 K
Ki 4.07e+3±n/a nM
Citation Macias, ATWilliamson, DSAllen, NBorgognoni, JClay, ADaniels, ZDokurno, PDrysdale, MJFrancis, GLGraham, CJHowes, RMatassova, NMurray, JBParsons, RShaw, TSurgenor, AETerry, LWang, YWood, MMassey, AJ Adenosine-derived inhibitors of 78 kDa glucose regulated protein (Grp78) ATPase: insights into isoform selectivity. J Med Chem54:4034-41 (2011) 
 
Heat shock 70 kDa protein 1A
Name:Heat shock 70 kDa protein 1A
Type:Chaperone
Mol. Mass.:70043.82
Organism:Homo sapiens (Human)
Description:n/a
Residue:641
BDBM82126
NameBDBM82126
Synonyms:(2R,3R,4S,5R)-2-(6-Amino-8-methylaminopurin-9-yl)-5- cyclohexylmethoxymethyltetrahydrofuran-3,4-diol | adenosine-derived inhibitor (Grp78), 5
TypeSmall organic molecule
Emp. Form.C18H28N6O4
Mol. Mass.392.4527
SMILESCNc1nc2c(N)ncnc2n1[C@@H]1O[C@H](COCC2CCCCC2)[C@@H](O)[C@H]1O