Reaction Details
TargetHeat shock 70 kDa protein 1A
LigandBDBM32377
Substrate/Competitorn/a
Meas. Tech.Fluorescence-Polarization (FP) Binding Assay
pH7.4±0
Temperature298.15±0 K
Ki 1.05e+3±n/a nM
Citation Macias, ATWilliamson, DSAllen, NBorgognoni, JClay, ADaniels, ZDokurno, PDrysdale, MJFrancis, GLGraham, CJHowes, RMatassova, NMurray, JBParsons, RShaw, TSurgenor, AETerry, LWang, YWood, MMassey, AJ Adenosine-derived inhibitors of 78 kDa glucose regulated protein (Grp78) ATPase: insights into isoform selectivity. J Med Chem54:4034-41 (2011) 
 
Heat shock 70 kDa protein 1A
Name:Heat shock 70 kDa protein 1A
Type:Chaperone
Mol. Mass.:70043.82
Organism:Homo sapiens (Human)
Description:n/a
Residue:641
BDBM32377
NameBDBM32377
Synonyms:adenosine-derived inhibitor (Grp78), 12 | adenosine-derived inhibitor, 11
TypeSmall organic molecule
Emp. Form.C24H24Cl2N6O4
Mol. Mass.531.391
SMILESNc1ncnc2n([C@@H]3O[C@H](COCc4ccccc4)[C@@H](O)[C@H]3O)c(NCc3ccc(Cl)c(Cl)c3)nc12