Reaction Details
TargetHeat shock 70 kDa protein 1A
LigandBDBM32381
Substrate/Competitorn/a
Meas. Tech.Fluorescence-Polarization (FP) Binding Assay
pH7.4±0
Temperature298.15±0 K
Ki 3.1e+2±n/a nM
Citation Macias, ATWilliamson, DSAllen, NBorgognoni, JClay, ADaniels, ZDokurno, PDrysdale, MJFrancis, GLGraham, CJHowes, RMatassova, NMurray, JBParsons, RShaw, TSurgenor, AETerry, LWang, YWood, MMassey, AJ Adenosine-derived inhibitors of 78 kDa glucose regulated protein (Grp78) ATPase: insights into isoform selectivity. J Med Chem54:4034-41 (2011) 
 
Heat shock 70 kDa protein 1A
Name:Heat shock 70 kDa protein 1A
Type:Chaperone
Mol. Mass.:70043.82
Organism:Homo sapiens (Human)
Description:n/a
Residue:641
BDBM32381
NameBDBM32381
Synonyms:adenosine-derived inhibitor (Grp78), 14 | adenosine-derived inhibitor, 15
TypeSmall organic molecule
Emp. Form.C28H26N8O4
Mol. Mass.538.5572
SMILESNc1ncnc2n([C@@H]3O[C@H](COCc4ccc(cc4)C#N)[C@@H](O)[C@H]3O)c(NCc3ccc4ncccc4c3)nc12