Reaction Details
TargetTyrosine-protein kinase ABL1
LigandBDBM50293992
Substrate/Competitorn/a
Meas. Tech.In Vitro Kinase Assay
IC50 48±0.0 nM
Citation Zhou, TCommodore, LHuang, WSWang, YSawyer, TKShakespeare, WCClackson, TZhu, XDalgarno, DC Structural analysis of DFG-in and DFG-out dual Src-Abl inhibitors sharing a common vinyl purine template. Chem Biol Drug Des75:18-28 (2010) 
 
Tyrosine-protein kinase ABL1
Name:Tyrosine-protein kinase ABL1
Type:Enzyme
Mol. Mass.:122897.30
Organism:Homo sapiens (Human)
Description:P00519
Residue:1130
BDBM50293992
NameBDBM50293992
Synonyms:(E)-3-(2-(Purin-9-yl)vinyl)-4-methyl-N-(3-(4-methyl-1-imidazol-1-yl)-5-(trifluoromethyl)phenyl)benzamide CHEMBL559838
TypeSmall organic molecule
Emp. Form.C26H20F3N7O
Mol. Mass.503.4785
SMILESCc1cn(cn1)-c1cc(NC(=O)c2ccc(C)c(\C=C\n3cnc4cncnc34)c2)cc(c1)C(F)(F)F