Reaction Details
TargetTyrosine-protein kinase ABL1 [T315I]
LigandBDBM50244526
Substrate/Competitorn/a
Meas. Tech.In Vitro Kinase Assay
IC50>5000±0.0 nM
Citation Zhou, TCommodore, LHuang, WSWang, YSawyer, TKShakespeare, WCClackson, TZhu, XDalgarno, DC Structural analysis of DFG-in and DFG-out dual Src-Abl inhibitors sharing a common vinyl purine template. Chem Biol Drug Des75:18-28 (2010) 
 
Tyrosine-protein kinase ABL1 [T315I]
Name:Tyrosine-protein kinase ABL1 [T315I]
Type:n/a
Mol. Mass.:122909.35
Organism:Homo sapiens (Human)
Description:P00519 (T315I)
Residue:1130
BDBM50244526
NameBDBM50244526
Synonyms:9-(2-(1H-indol-4-yl)vinyl)-N-(4-(dimethylphosphoryl)phenyl)-9H-purin-6-amine CHEMBL454868
TypeSmall organic molecule
Emp. Form.C23H21N6OP
Mol. Mass.428.4262
SMILESCP(C)(=O)c1ccc(Nc2ncnc3n(\C=C\c4cccc5[nH]ccc45)cnc23)cc1