Reaction Details
TargetIsoform 1 of Fibronectin (1)
LigandBDBM50244569
Substrate/Competitorn/a
Meas. Tech.In Vitro Kinase Assay
IC50<0.5±0.0 nM
Citation Zhou, TCommodore, LHuang, WSWang, YSawyer, TKShakespeare, WCClackson, TZhu, XDalgarno, DC Structural analysis of DFG-in and DFG-out dual Src-Abl inhibitors sharing a common vinyl purine template. Chem Biol Drug Des75:18-28 (2010) 
 
Isoform 1 of Fibronectin (1)
Name:Isoform 1 of Fibronectin (1)
Type:PROTEIN
Mol. Mass.:262571.78
Organism:Homo sapiens (Human)
Description:EBI_17040
Residue:2386
BDBM50244569
NameBDBM50244569
Synonyms:AP24283 N-(4-(dimethylphosphoryl)phenyl)-9-(2-(5-methyl-1H-indazol-4-yl)vinyl)-9H-purin-6-amine | N-[4-(dimethylphosphoryl)phenyl]-9-[(E)-2-(5-methyl-1H-indazol-4-yl)ethenyl]-9H-purin-6-amine
TypeSmall organic molecule
Emp. Form.C23H22N7OP
Mol. Mass.443.4408
SMILESCc1ccc2[nH]ncc2c1\C=C\n1cnc2c(Nc3ccc(cc3)P(C)(C)=O)ncnc12