Reaction Details
TargetProto-oncogene tyrosine-protein kinase Src
LigandBDBM50294011
Substrate/Competitorn/a
Meas. Tech.In Vitro Kinase Assay
IC50 7.6±0.0 nM
Citation Zhou, TCommodore, LHuang, WSWang, YSawyer, TKShakespeare, WCClackson, TZhu, XDalgarno, DC Structural analysis of DFG-in and DFG-out dual Src-Abl inhibitors sharing a common vinyl purine template. Chem Biol Drug Des75:18-28 (2010) 
 
Proto-oncogene tyrosine-protein kinase Src
Name:Proto-oncogene tyrosine-protein kinase Src
Type:Protein
Mol. Mass.:59838.60
Organism:Homo sapiens (Human)
Description:P12931
Residue:536
BDBM50294011
NameBDBM50294011
Synonyms:(E)-3-(2-(6-(Cyclopropylamino)-9H-purin-9-yl)vinyl)-4-methyl-N-(3-(4-methyl-1-imidazol-1-yl)-5-(trifluoromethyl)phenyl)benzamide 3-(2-(6-(cyclopropylamino)-9H-purin-9-yl)vinyl)-4-methyl-N-(3-(4-methyl-1H-imidazol-1-yl)-5-(trifluoromethyl)phenyl)benzamide AP-24163 CHEMBL539433
TypeSmall organic molecule
Emp. Form.C29H25F3N8O
Mol. Mass.558.557
SMILESCc1cn(cn1)-c1cc(NC(=O)c2ccc(C)c(\C=C\n3cnc4c(NC5CC5)ncnc34)c2)cc(c1)C(F)(F)F