Reaction Details
TargetCannabinoid receptor 1
LigandBDBM82135
Substrate/Competitorn/a
Meas. Tech.Binding Assay
pH7.4±0
Temperature298.15±0 K
Ki 8.4±2.0 nM
Citation Mazzoni, ODiurno, MVdi Bosco, AMNovellino, EGrieco, PEsposito, GBertamino, ACalignano, ARusso, R Synthesis and pharmacological evaluation of analogs of indole-based cannabimimetic agents. Chem Biol Drug Des75:106-14 (2010) 
 
Cannabinoid receptor 1
Name:Cannabinoid receptor 1
Type:G Protein-Coupled Receptor (GPCR)
Mol. Mass.:52856.55
Organism:Rattus norvegicus (rat)
Description:P20272
Residue:473
BDBM82135
NameBDBM82135
Synonyms:5-Substituted derivative, 5
TypeSmall organic molecule
Emp. Form.C24H22ClN3O2
Mol. Mass.419.903
SMILESClc1ccc2N(CCN3CCOCC3)C(=O)\C(=N/c3cccc4ccccc34)c2c1