Reaction Details
TargetAlpha-1,6-mannosyl-glycoprotein 2-beta-N-acetylglucosaminyltransferase
LigandBDBM271895
Substrate/Competitorn/a
Meas. Tech.MGAT2 Human Assay
Temperature298.15±n/a K
IC50 8.10±n/a nM
Commentsextracted
Citation Berger, RBlizzard, TACampbell, BTChen, HYDebenham, JSDewnani, SVDubois, BGude, CGuo, ZZHarper, BHu, ZLin, SLiu, PWang, MUjjainwalla, FXu, JXu, LZhang, R Isoquinoline derivatives as MGAT2 inhibitors US Patent US10065945 Publication Date 9/4/2018
 
Alpha-1,6-mannosyl-glycoprotein 2-beta-N-acetylglucosaminyltransferase
Name:Alpha-1,6-mannosyl-glycoprotein 2-beta-N-acetylglucosaminyltransferase
Type:n/a
Mol. Mass.:51567.80
Organism:Homo sapiens (Human)
Description:Q10469
Residue:447
BDBM271895
NameBDBM271895
Synonyms:US10065945, Example 7
TypeSmall organic molecule
Emp. Form.C22H24F3N5O4S
Mol. Mass.511.517
SMILESCCc1noc(NS(=O)(=O)c2ccc3CCN(Cc3c2)[C@H](C)c2ccc(OCC(F)(F)F)nc2)n1