Reaction Details
TargetSerum paraoxonase/arylesterase 1
LigandBDBM82185
Substrate/Competitorn/a
Meas. Tech.In Vitro Inhibtion Assay
Ki 570000±0.0 nM
IC50 260000±0.0 nM
Citation Ekinci, DSentürk, MBeydemir, SKüfrevioglu, OISupuran, CT An alternative purification method for human serum paraoxonase 1 and its interactions with sulfonamides. Chem Biol Drug Des76:552-8 (2010) 
 
Serum paraoxonase/arylesterase 1
Name:Serum paraoxonase/arylesterase 1
Type:Enzyme
Mol. Mass.:39719.73
Organism:Homo sapiens (Human)
Description:P27169
Residue:355
BDBM82185
NameBDBM82185
Synonyms:Sulfosalazine, 3
TypeSmall organic molecule
Emp. Form.C18H14N4O5S
Mol. Mass.398.393
SMILESOC(=O)c1ccc(cc1O)\N=N\c1ccc(cc1)S(=O)(=O)Nc1ccccn1