Reaction Details
TargetSerum paraoxonase/arylesterase 1
LigandBDBM10868
Substrate/Competitorn/a
Meas. Tech.In Vitro Inhibtion Assay
Ki 2001000±0.0 nM
IC50 1240000±0.0 nM
Citation Ekinci, DSentürk, MBeydemir, SKüfrevioglu, OISupuran, CT An alternative purification method for human serum paraoxonase 1 and its interactions with sulfonamides. Chem Biol Drug Des76:552-8 (2010) 
 
Serum paraoxonase/arylesterase 1
Name:Serum paraoxonase/arylesterase 1
Type:Enzyme
Mol. Mass.:39719.73
Organism:Homo sapiens (Human)
Description:P27169
Residue:355
BDBM10868
NameBDBM10868
Synonyms:1,3,4-Thiadiazole-2-sulfonamide, 6 5-Amino-1,3,4-thiadiazole-2-sulphonamide (1) CHEMBL265674 | aromatic/heteroaromatic sulfonamide 13
TypeSmall organic molecule
Emp. Form.C2H4N4O2S2
Mol. Mass.180.209
SMILESNc1nnc(s1)S(N)(=O)=O