Reaction Details
Target72 kDa type IV collagenase
LigandBDBM82186
Substrate/Competitorn/a
Meas. Tech.Inhibition Assay
IC50 6.1e+2±n/a nM
Citation Durrant, JDde Oliveira, CAMcCammon, JA Pyrone-based inhibitors of metalloproteinase types 2 and 3 may work as conformation-selective inhibitors. Chem Biol Drug Des78:191-8 (2011) 
 
72 kDa type IV collagenase
Name:72 kDa type IV collagenase
Type:Enzyme
Mol. Mass.:73870.36
Organism:Homo sapiens (Human)
Description: P08253
Residue:660
BDBM82186
NameBDBM82186
Synonyms:AM-5
TypeSmall orgnaic molecule
Emp. Form.C21H16N2O4
Mol. Mass.360.3627
SMILESCc1cc(=O)c(O)c(o1)C(=O)NCc1ccc(cc1)-c1ccc(cc1)C#N