Reaction Details
TargetStromelysin-1
LigandBDBM82186
Substrate/Competitorn/a
Meas. Tech.Inhibition Assay
IC50 10±n/a nM
Citation Durrant, JDde Oliveira, CAMcCammon, JA Pyrone-based inhibitors of metalloproteinase types 2 and 3 may work as conformation-selective inhibitors. Chem Biol Drug Des78:191-8 (2011) 
 
Stromelysin-1
Name:Stromelysin-1
Type:Enzyme
Mol. Mass.:53973.13
Organism:Homo sapiens (Human)
Description: P08254
Residue:477
BDBM82186
NameBDBM82186
Synonyms:AM-5
TypeSmall orgnaic molecule
Emp. Form.C21H16N2O4
Mol. Mass.360.3627
SMILESCc1cc(=O)c(O)c(o1)C(=O)NCc1ccc(cc1)-c1ccc(cc1)C#N