Reaction Details
TargetStromelysin-1
LigandBDBM50264772
Substrate/Competitorn/a
Meas. Tech.Inhibition Assay
IC50 19±n/a nM
Citation Durrant, JDde Oliveira, CAMcCammon, JA Pyrone-based inhibitors of metalloproteinase types 2 and 3 may work as conformation-selective inhibitors. Chem Biol Drug Des78:191-8 (2011) 
 
Stromelysin-1
Name:Stromelysin-1
Type:Enzyme
Mol. Mass.:53973.13
Organism:Homo sapiens (Human)
Description: P08254
Residue:477
BDBM50264772
NameBDBM50264772
Synonyms:3-Hydroxy-6-methyl-4-oxo-4H-pyran-2-carboxylic acid ([1,1';4',1'']terphenyl-4-ylmethyl)-amide CHEMBL489603
TypeSmall organic molecule
Emp. Form.C26H21NO4
Mol. Mass.411.4492
SMILESCc1cc(=O)c(O)c(o1)C(=O)NCc1ccc(cc1)-c1ccc(cc1)-c1ccccc1