Reaction Details
TargetProstacyclin receptor
LigandBDBM82094
Substrate/Competitorn/a
Ki 4370±n/a nM
CommentsPDSP_1464
Citation MacDermot, JBlair, IACresp, TM Prostacyclin receptors of a neuronal hybrid cell line. Divalent citations and ligand-receptor coupling. Biochem Pharmacol30:2041-4 (1981) 
 
Prostacyclin receptor
Name:Prostacyclin receptor
Type:Enzyme Catalytic Domain
Mol. Mass.:44475.65
Organism:MOUSE
Description:Prostaglandin I2 PTGIR MOUSE::P43252
Residue:415
BDBM82094
NameBDBM82094
Synonyms:17-PHENYL TRINOR PROSTAGLANDIN E2 PGE2,17-Phenyl
TypeSmall organic molecule
Emp. Form.C23H30O5
Mol. Mass.386.4813
SMILESO[C@@H](CCc1ccccc1)\C=C\[C@H]1[C@H](O)CC(=O)[C@@H]1C\C=C/CCCC(O)=O