Reaction Details
TargetProstacyclin receptor
LigandBDBM82092
Substrate/Competitorn/a
Ki>10000±n/a nM
CommentsPDSP_5310
Citation MacDermot, JBlair, IACresp, TM Prostacyclin receptors of a neuronal hybrid cell line. Divalent citations and ligand-receptor coupling. Biochem Pharmacol30:2041-4 (1981) 
 
Prostacyclin receptor
Name:Prostacyclin receptor
Type:Enzyme Catalytic Domain
Mol. Mass.:44475.65
Organism:MOUSE
Description:Prostaglandin I2 PTGIR MOUSE::P43252
Residue:415
BDBM82092
NameBDBM82092
Synonyms:CAS_5280939 PGF1alpha
TypeSmall organic molecule
Emp. Form.C20H36O5
Mol. Mass.356.4968
SMILESCCCCCC(O)C=CC1C(O)CC(O)C1CCCCCCC(O)=O