Reaction Details
TargetProstacyclin receptor
LigandBDBM82097
Substrate/Competitorn/a
Ki 7350±n/a nM
CommentsPDSP_5307
Citation MacDermot, JBlair, IACresp, TM Prostacyclin receptors of a neuronal hybrid cell line. Divalent citations and ligand-receptor coupling. Biochem Pharmacol30:2041-4 (1981) 
 
Prostacyclin receptor
Name:Prostacyclin receptor
Type:Enzyme Catalytic Domain
Mol. Mass.:44475.65
Organism:MOUSE
Description:Prostaglandin I2 PTGIR MOUSE::P43252
Residue:415
BDBM82097
NameBDBM82097
Synonyms:CAS_162981 PGI1, 6beta
TypeSmall organic molecule
Emp. Form.C20H34O5
Mol. Mass.354.481
SMILESCCCCCC(O)C=CC1C(O)CC2OC(CCCCC(O)=O)CC12