Reaction Details
TargetSodium-dependent serotonin transporter
LigandBDBM82217
Substrate/Competitorn/a
Ki 58±n/a nM
CommentsPDSP_1710
Citation Koe, BKWeissman, AWelch, WMBrowne, RG Sertraline, 1S,4S-N-methyl-4-(3,4-dichlorophenyl)-1,2,3,4-tetrahydro-1-naphthylamine, a new uptake inhibitor with selectivity for serotonin. J Pharmacol Exp Ther226:686-700 (1983) Sodium-dependent serotonin transporter
Name:Sodium-dependent serotonin transporter
Type:Multi-pass membrane protein
Mol. Mass.:70168.43
Organism:Rattus norvegicus (rat)
Description:P31652
Residue:630
BDBM82217
NameBDBM82217
Synonyms:CHEMBL284994 SERTRALINE | [4-(3,4-Dichloro-phenyl)-1,2,3,4-tetrahydro-naphthalen-1-yl]-methyl-amine
Typen/a
Emp. Form.C17H17Cl2N
Mol. Mass.306.23
SMILESCN[C@@H]1CC[C@@H](c2ccc(Cl)c(Cl)c2)c2ccccc12