Reaction Details
TargetNorepinephrine transporter
LigandBDBM82217
Substrate/Competitorn/a
Ki 11±n/a nM
CommentsPDSP_4196
Citation Koe, BKWeissman, AWelch, WMBrowne, RG Sertraline, 1S,4S-N-methyl-4-(3,4-dichlorophenyl)-1,2,3,4-tetrahydro-1-naphthylamine, a new uptake inhibitor with selectivity for serotonin. J Pharmacol Exp Ther226:686-700 (1983) Norepinephrine transporter
Name:Norepinephrine transporter
Synonyms:n/a
Type:Enzyme Catalytic Domain
Mol. Mass.:2082.45
Organism:RAT
Description:Norepinephrine transporter 0 RAT::Q9JIA2
Residue:19
MLLARMKPQVQPELGGADQ
BDBM82217
NameBDBM82217
Typen/a
Emp. Form.C17H17Cl2N
Mol. Mass.306.23
SMILESCN[C@@H]1CC[C@@H](c2ccc(Cl)c(Cl)c2)c2ccccc12