Reaction Details
TargetCholecystokinin
LigandBDBM82231
Substrate/Competitorn/a
Ki 15.9±n/a nM
CommentsPDSP_2685
Citation Van Dijk, ARichards, JGTrzeciak, AGillessen, DMöhler, H Cholecystokinin receptors: biochemical demonstration and autoradiographical localization in rat brain and pancreas using [3H] cholecystokinin8 as radioligand. J Neurosci4:1021-33 (1984) Cholecystokinin
Name:Cholecystokinin
Type:Enzyme Catalytic Domain
Mol. Mass.:12844.29
Organism:RAT
Description:Cholecystokinin 0 RAT::P01355
Residue:115
BDBM82231
NameBDBM82231
Synonyms:Gastrin-I-(4-17)
TypeSmall organic molecule
Emp. Form.C85H109N17O27S
Mol. Mass.1832.938
SMILESCSCC[C@H](NC(=O)[C@H](Cc1c[nH]c2ccccc12)NC(=O)CNC(=O)[C@H](Cc1ccc(O)cc1)NC(=O)[C@H](C)NC(=O)[C@H](CCC(O)=O)NC(=O)[C@H](CCC(O)=O)NC(=O)[C@H](CCC(O)=O)NC(=O)[C@H](CCC(O)=O)NC(=O)[C@H](CCC(O)=O)NC(=O)[C@H](CC(C)C)NC(=O)[C@@H](N)Cc1c[nH]c2ccccc12)C(=O)N[C@@H](CC(O)=O)C(=O)N[C@@H](Cc1ccccc1)C(N)=O