Reaction Details
TargetCholecystokinin
LigandBDBM81822
Substrate/Competitorn/a
Ki 200±n/a nM
CommentsPDSP_2618
Citation Van Dijk, ARichards, JGTrzeciak, AGillessen, DMöhler, H Cholecystokinin receptors: biochemical demonstration and autoradiographical localization in rat brain and pancreas using [3H] cholecystokinin8 as radioligand. J Neurosci4:1021-33 (1984) Cholecystokinin
Name:Cholecystokinin
Type:Enzyme Catalytic Domain
Mol. Mass.:12844.29
Organism:RAT
Description:Cholecystokinin 0 RAT::P01355
Residue:115
BDBM81822
NameBDBM81822
Synonyms:CAS_6804 Guanosine | NSC_6804
TypeSmall organic molecule
Emp. Form.C10H14N5O8P
Mol. Mass.363.2206
SMILESNc1nc2n(cnc2c(=O)[nH]1)C1OC(COP(O)(O)=O)C(O)C1O