Reaction Details
TargetVoltage-dependent L-type calcium channel subunit alpha-1C
LigandBDBM50318493
Substrate/Competitorn/a
Ki 0.79±n/a nM
CommentsPDSP_2654
Citation Ehlert, FJRoeske, WRItoga, EYamamura, HI The binding of [3H]nitrendipine to receptors for calcium channel antagonists in the heart, cerebral cortex, and ileum of rats. Life Sci30:2191-202 (1982) 
 
Voltage-dependent L-type calcium channel subunit alpha-1C
Name:Voltage-dependent L-type calcium channel subunit alpha-1C
Type:Enzyme Catalytic Domain
Mol. Mass.:243492.26
Organism:RAT
Description:Calcium channel 0 RAT::P22002
Residue:2169
BDBM50318493
NameBDBM50318493
Synonyms:3-isopropyl 5-(2-methoxyethyl) 2,6-dimethyl-4-(3-nitrophenyl)-1,4-dihydropyridine-3,5-dicarboxylate CHEMBL1428 Nimotop
TypeSmall organic molecule
Emp. Form.C21H26N2O7
Mol. Mass.418.4403
SMILESCOCCOC(=O)C1=C(C)N=C(C)C(C1c1cccc(c1)[N+]([O-])=O)C(=O)OC(C)C