Reaction Details
TargetMetabotropic glutamate receptor 1
LigandBDBM50030627
Substrate/Competitorn/a
Ki>10000±n/a nM
CommentsPDSP_4807
Citation Thomsen, CBoel, ESuzdak, PD Actions of phenylglycine analogs at subtypes of the metabotropic glutamate receptor family. Eur J Pharmacol267:77-84 (1994) 
 
Metabotropic glutamate receptor 1
Name:Metabotropic glutamate receptor 1
Type:Enzyme Catalytic Domain
Mol. Mass.:133240.47
Organism:RAT
Description:metabotropic glutamate 1/2 0 RAT::P23385
Residue:1199
BDBM50030627
NameBDBM50030627
Synonyms:(+-)-MCPG 4-(1-Amino-1-carboxy-ethyl)-benzoic acid CHEMBL299683 | MCPG
TypeSmall organic molecule
Emp. Form.C10H11NO4
Mol. Mass.209.1986
SMILESCC(N)(C(O)=O)c1ccc(cc1)C(O)=O