Reaction Details
TargetNicotinic acetylcholine receptor
LigandBDBM50035398
Substrate/Competitorn/a
Ki>10000±n/a nM
CommentsPDSP_222
Citation Arneric, SPSullivan, JPBriggs, CADonnelly-Roberts, DAnderson, DJRaszkiewicz, JLHughes, MLCadman, EDAdams, PGarvey, DS (S)-3-methyl-5-(1-methyl-2-pyrrolidinyl) isoxazole (ABT 418): a novel cholinergic ligand with cognition-enhancing and anxiolytic activities: I. In vitro characterization. J Pharmacol Exp Ther270:310-8 (1994) Nicotinic acetylcholine receptor
Name:Nicotinic acetylcholine receptor
Type:Enzyme Catalytic Domain
Mol. Mass.:2478.99
Organism:RAT
Description:n-AChR 0 RAT::Q62594
Residue:23
BDBM50035398
NameBDBM50035398
Synonyms:(S)-1-Methyl-2-(3-methyl-isoxazol-5-yl)-pyrrolidinium 3-Methyl-5-((S)-1-methyl-pyrrolidin-2-yl)-isoxazole CHEMBL274525
TypeSmall organic molecule
Emp. Form.C9H14N2O
Mol. Mass.166.2203
SMILESCN1CCC[C@H]1c1cc(C)no1