Reaction Details
TargetHistone deacetylase 9
LigandBDBM272065
Substrate/Competitorn/a
Meas. Tech.HDAC9 Biochemicle Assay
IC50 28.0±n/a nM
Citation Dominguez, CMuñoz-Sanjuán, IBürli, RWLuckhurst, CAAllen, DRRaphy, GBreccia, PHaughan, AFWishart, GHughes, SJJarvis, REVater, HDPenrose, SDWall, MStott, AJSaville-Stones, EA Histone deacetylase inhibitors and compositions and methods of use thereof US Patent US10065948 Publication Date 9/4/2018
 
Histone deacetylase 9
Name:Histone deacetylase 9
Type:Enzyme
Mol. Mass.:111304.31
Organism:Homo sapiens (Human)
Description:Q9UKV0
Residue:1011
BDBM272065
NameBDBM272065
Synonyms:(S)-5-(3-Fluoro-2-methylphenyl)-N-hydroxy-1-phenyl- l,4,5,6-tetrahydrocyclopenta[c]pyrazole-5- carboxamide US10457675, Example 30
TypeSmall organic molecule
Emp. Form.C20H18FN3O2
Mol. Mass.351.3742
SMILESCc1c(F)cccc1[C@@]1(Cc2cnn(c2C1)-c1ccccc1)C(=O)NO