Reaction Details
TargetHistone deacetylase 9
LigandBDBM272086
Substrate/Competitorn/a
Meas. Tech.HDAC9 Biochemicle Assay
IC50 44.0±n/a nM
Citation Dominguez, CMuñoz-Sanjuán, IBürli, RWLuckhurst, CAAllen, DRRaphy, GBreccia, PHaughan, AFWishart, GHughes, SJJarvis, REVater, HDPenrose, SDWall, MStott, AJSaville-Stones, EA Histone deacetylase inhibitors and compositions and methods of use thereof US Patent US10065948 Publication Date 9/4/2018
 
Histone deacetylase 9
Name:Histone deacetylase 9
Type:Enzyme
Mol. Mass.:111304.31
Organism:Homo sapiens (Human)
Description:Q9UKV0
Residue:1011
BDBM272086
NameBDBM272086
Synonyms:(S)-5-(3-Fluoro-2-methylphenyl)-1-(4-fluoro-2- methylphenyl)-N-hydroxy-1,4,5,6- tetrahydrocyclopenta[c]pyrazole-5-carboxamide US10457675, Example 22
TypeSmall organic molecule
Emp. Form.C21H19F2N3O2
Mol. Mass.383.3913
SMILESCc1cc(F)ccc1-n1ncc2C[C@@](Cc12)(C(=O)NO)c1cccc(F)c1C