Reaction Details
TargetHistone deacetylase 9
LigandBDBM272088
Substrate/Competitorn/a
Meas. Tech.HDAC9 Biochemicle Assay
IC50 28.0±n/a nM
Citation Dominguez, CMuñoz-Sanjuán, IBürli, RWLuckhurst, CAAllen, DRRaphy, GBreccia, PHaughan, AFWishart, GHughes, SJJarvis, REVater, HDPenrose, SDWall, MStott, AJSaville-Stones, EA Histone deacetylase inhibitors and compositions and methods of use thereof US Patent US10065948 Publication Date 9/4/2018
 
Histone deacetylase 9
Name:Histone deacetylase 9
Type:Enzyme
Mol. Mass.:111304.31
Organism:Homo sapiens (Human)
Description:Q9UKV0
Residue:1011
BDBM272088
NameBDBM272088
Synonyms:(S)-5-(3-Fluoro-2-methylphenyl)-N-hydroxy-1-(m- tolyl)-1,4,5,6-tetrahydrocyclopenta[c]pyrazole-5- carboxamide US10457675, Example 24
TypeSmall organic molecule
Emp. Form.C21H20FN3O2
Mol. Mass.365.4008
SMILESCc1cccc(c1)-n1ncc2C[C@@](Cc12)(C(=O)NO)c1cccc(F)c1C