Reaction Details
TargetHistone deacetylase 9
LigandBDBM272133
Substrate/Competitorn/a
Meas. Tech.HDAC9 Biochemicle Assay
IC50 44.0±n/a nM
Citation Dominguez, CMuñoz-Sanjuán, IBürli, RWLuckhurst, CAAllen, DRRaphy, GBreccia, PHaughan, AFWishart, GHughes, SJJarvis, REVater, HDPenrose, SDWall, MStott, AJSaville-Stones, EA Histone deacetylase inhibitors and compositions and methods of use thereof US Patent US10065948 Publication Date 9/4/2018
 
Histone deacetylase 9
Name:Histone deacetylase 9
Type:Enzyme
Mol. Mass.:111304.31
Organism:Homo sapiens (Human)
Description:Q9UKV0
Residue:1011
BDBM272133
NameBDBM272133
Synonyms:(R)-5-(3-Fluoro-2-methylphenyl)-N-hydroxy-2-(1- methyl-1H-pyrazol-5-yl)-5,6-dihydro-4H- cyclopenta[d]thiazole-5-carboxamide US10457675, Example 69
TypeSmall organic molecule
Emp. Form.C18H17FN4O2S
Mol. Mass.372.417
SMILESCc1c(F)cccc1[C@]1(Cc2nc(sc2C1)-c1ccnn1C)C(=O)NO