Reaction Details
TargetSomatostatin receptor type 2
LigandBDBM82255
Substrate/Competitorn/a
Ki 0.01±n/a nM
CommentsPDSP_1295
Citation Rossowski, WJGu, ZFAkarca, USJensen, RTCoy, DH Characterization of somatostatin receptor subtypes controlling rat gastric acid and pancreatic amylase release. Peptides15:1421-4 (1994) 
 
Somatostatin receptor type 2
Name:Somatostatin receptor type 2
Type:Enzyme Catalytic Domain
Mol. Mass.:41212.21
Organism:RAT
Description:SOMATOSTATIN SST2 SSTR2 RAT::P30680
Residue:369
BDBM82255
NameBDBM82255
Synonyms:D-Phe-Cys-Tyr-D-Trp-Lys-Abu-Cys-Nal-NH | NC8-12
Typen/a
Emp. Form.C57H69N11O8S2
Mol. Mass.1100.357
SMILESNCCCCC1NC(=O)C(Cc2c[nH]c3ccccc23)NC(=O)C(Cc2ccc(O)cc2)NC(=O)C(CSSCC(NC(=O)C(CCCN)NC1=O)C(=O)NCc1cccc2ccccc12)NC(=O)C(N)Cc1ccccc1