Reaction Details
TargetSomatostatin receptor type 5
LigandBDBM81767
Substrate/Competitorn/a
Ki 1.2±n/a nM
CommentsPDSP_1735
Citation Rossowski, WJGu, ZFAkarca, USJensen, RTCoy, DH Characterization of somatostatin receptor subtypes controlling rat gastric acid and pancreatic amylase release. Peptides15:1421-4 (1994) 
 
Somatostatin receptor type 5
Name:Somatostatin receptor type 5
Type:Enzyme Catalytic Domain
Mol. Mass.:39986.50
Organism:RAT
Description:SOMATOSTATIN SST5 SSTR5 RAT::P30938
Residue:363
BDBM81767
NameBDBM81767
Synonyms:15-28-Somatostatin-28 CB6417646 | Somatostatin-14
TypeSmall organic molecule
Emp. Form.C76H104N18O19S2
Mol. Mass.1637.878
SMILESC[C@@H](O)[C@@H]1NC(=O)[C@H](Cc2ccccc2)NC(=O)[C@@H](NC(=O)[C@H](CCCCN)NC(=O)[C@H](Cc2c[nH]c3ccccc23)NC(=O)[C@H](Cc2ccccc2)NC(=O)[C@H](Cc2ccccc2)NC(=O)[C@H](CC(N)=O)NC(=O)[C@H](CCCCN)NC(=O)[C@H](CSSC[C@H](NC(=O)[C@H](CO)NC1=O)C(O)=O)NC(=O)CNC(=O)[C@H](C)N)[C@@H](C)O