Reaction Details
TargetEnvelope glycoprotein gp160
LigandBDBM272520
Substrate/Competitorn/a
Meas. Tech.Infectivity Assay
EC50 32.0±n/a nM
Citation Connolly, TPEastman, KJNaidu, BNPeese, K Imidazo[1,2-A]pyridine derivatives for use as inhibitors of human immunodeficiency virus replication US Patent US10065953 Publication Date 9/4/2018
 
Envelope glycoprotein gp160
Name:Envelope glycoprotein gp160
Type:PROTEIN
Mol. Mass.:97512.49
Organism:Human immunodeficiency virus type 1 (isolate BRU/LAI group M subtypeB) (HIV-1)
Description:ChEMBL_536779
Residue:861
BDBM272520
NameBDBM272520
Synonyms:US10065953, Example 2
TypeSmall organic molecule
Emp. Form.C34H41N3O3
Mol. Mass.539.7076
SMILESCc1ccc(cc1)-c1cccc(c1)-c1cn2c(N3CCC(C)(C)CC3)c([C@H](OC(C)(C)C)C(O)=O)c(C)cc2n1