Reaction Details
TargetNeuropeptide Y receptor type 2
LigandBDBM82290
Substrate/Competitorn/a
Ki 1.5±n/a nM
CommentsPDSP_1563
Citation Gerald, CWalker, MWVaysse, PJHe, CBranchek, TAWeinshank, RL Expression cloning and pharmacological characterization of a human hippocampal neuropeptide Y/peptide YY Y2 receptor subtype. J Biol Chem270:26758-61 (1995) 
 
Neuropeptide Y receptor type 2
Name:Neuropeptide Y receptor type 2
Type:Enzyme Catalytic Domain
Mol. Mass.:42734.65
Organism:Homo sapiens (Human)
Description:NPY-Y2 NPY2R HUMAN::P49146
Residue:381
BDBM82290
NameBDBM82290
Synonyms:PYY 3-36, rat | PYY13-36, porcine
TypeSmall organic molecule
Emp. Form.C135H208N40O39
Mol. Mass.3015.3406
SMILESCC(C)C[C@H](NC(=O)[C@H](CCC(O)=O)NC(=O)[C@H](CCC(O)=O)NC(=O)[C@@H]1CCCN1C(=O)[C@@H](N)CO)C(=O)N[C@@H](CO)C(=O)N[C@@H](CCCNC(N)=N)C(=O)N[C@@H](Cc1ccc(O)cc1)C(=O)N[C@@H](Cc1ccc(O)cc1)C(=O)N[C@@H](C)C(=O)N[C@@H](CO)C(=O)N[C@@H](CC(C)C)C(=O)N[C@@H](CCCNC(N)=N)C(=O)N[C@@H](Cc1cnc[nH]1)C(=O)N[C@@H](Cc1ccc(O)cc1)C(=O)N[C@@H](CC(C)C)C(=O)N[C@@H](CC(N)=O)C(=O)N[C@@H](CC(C)C)C(=O)N[C@@H](C(C)C)C(=O)N[C@@H]([C@@H](C)O)C(=O)N[C@@H](CCCNC(N)=N)C(=O)N[C@@H](CCC(N)=O)C(=O)N[C@@H](CCCNC(N)=N)C(=O)N[C@@H](Cc1ccc(O)cc1)C(O)=O