Reaction Details
TargetNeuromedin-K receptor
LigandBDBM50051290
Substrate/Competitorn/a
Ki 0.21±n/a nM
CommentsPDSP_1749
Citation Oury-Donat, FCarayon, PThurneyssen, OPailhon, VEmonds-Alt, XSoubrié, PLe Fur, G Functional characterization of the nonpeptide neurokinin3 (NK3) receptor antagonist, SR142801 on the human NK3 receptor expressed in Chinese hamster ovary cells. J Pharmacol Exp Ther274:148-54 (1995) Neuromedin-K receptor
Name:Neuromedin-K receptor
Type:Enzyme
Mol. Mass.:52221.96
Organism:Homo sapiens (Human)
Description:P29371
Residue:465
BDBM50051290
NameBDBM50051290
Synonyms:CHEMBL299377 SR 142801 SR-142801
TypeSmall organic molecule
Emp. Form.C35H41Cl2N3O2
Mol. Mass.606.625
SMILESCN(C(C)=O)C1(CCN(CCCC2(CCCN(C2)C(=O)c2ccccc2)c2ccc(Cl)c(Cl)c2)CC1)c1ccccc1