Reaction Details
Target5-hydroxytryptamine receptor 6
LigandBDBM50024202
Substrate/Competitorn/a
Ki 58±n/a nM
CommentsPDSP_162
Citation Monsma, FJShen, YWard, RPHamblin, MWSibley, DR Cloning and expression of a novel serotonin receptor with high affinity for tricyclic psychotropic drugs. Mol Pharmacol43:320-7 (1993) 5-hydroxytryptamine receptor 6
Name:5-hydroxytryptamine receptor 6
Type:Enzyme Catalytic Domain
Mol. Mass.:46945.51
Organism:RAT
Description:5-HT6 HTR6 RAT::P31388
Residue:436
BDBM50024202
NameBDBM50024202
Synonyms:5-HT,omega-N-Me CHEMBL277362 | N-methylserotonin
TypeSmall organic molecule
Emp. Form.C11H14N2O
Mol. Mass.190.2417
SMILESCNCCc1c[nH]c2ccc(O)cc12