Reaction Details
Target5-hydroxytryptamine receptor 6
LigandBDBM77970
Substrate/Competitorn/a
Ki 53.8±n/a nM
CommentsPDSP_541
Citation Monsma, FJShen, YWard, RPHamblin, MWSibley, DR Cloning and expression of a novel serotonin receptor with high affinity for tricyclic psychotropic drugs. Mol Pharmacol43:320-7 (1993) 5-hydroxytryptamine receptor 6
Name:5-hydroxytryptamine receptor 6
Type:Enzyme Catalytic Domain
Mol. Mass.:46945.51
Organism:RAT
Description:5-HT6 HTR6 RAT::P31388
Residue:436
BDBM77970
NameBDBM77970
Synonyms:3-(2-chloranyl-5,6-dihydrobenzo[b][1]benzazepin-11-yl)-N,N-dimethyl-propan-1-amine;hydrochloride 3-(2-chloro-5,6-dihydrobenzo[b][1]benzazepin-11-yl)-N,N-dimethylpropan-1-amine;hydrochloride CHLORIMIPRAMINE CLOMIPRAMINE HYDROCHLORIDE MLS000028511 cid_68539 | med.21724, Compound Clomipramine
TypeSmall organic molecule
Emp. Form.C19H23ClN2
Mol. Mass.314.852
SMILESCN(C)CCCN1c2ccccc2CCc2ccc(Cl)cc12