Reaction Details
Target5-hydroxytryptamine receptor 6
LigandBDBM50001915
Substrate/Competitorn/a
Ki 2300±n/a nM
CommentsPDSP_1168
Citation Monsma, FJShen, YWard, RPHamblin, MWSibley, DR Cloning and expression of a novel serotonin receptor with high affinity for tricyclic psychotropic drugs. Mol Pharmacol43:320-7 (1993) 5-hydroxytryptamine receptor 6
Name:5-hydroxytryptamine receptor 6
Type:Enzyme Catalytic Domain
Mol. Mass.:46945.51
Organism:RAT
Description:5-HT6 HTR6 RAT::P31388
Residue:436
BDBM50001915
NameBDBM50001915
Synonyms:1-(3-chlorophenyl)piperazine m-Chlorophenylpiperazine | mCPP
TypeSmall organic molecule
Emp. Form.C10H13ClN2
Mol. Mass.196.677
SMILESClc1cccc(c1)N1CCNCC1