Reaction Details
Target5-hydroxytryptamine receptor 6
LigandBDBM81782
Substrate/Competitorn/a
Ki 806±n/a nM
CommentsPDSP_1438
Citation Monsma, FJShen, YWard, RPHamblin, MWSibley, DR Cloning and expression of a novel serotonin receptor with high affinity for tricyclic psychotropic drugs. Mol Pharmacol43:320-7 (1993) 5-hydroxytryptamine receptor 6
Name:5-hydroxytryptamine receptor 6
Type:Enzyme Catalytic Domain
Mol. Mass.:46945.51
Organism:RAT
Description:5-HT6 HTR6 RAT::P31388
Residue:436
BDBM81782
NameBDBM81782
Synonyms:CAS_6270 PAPP
TypeSmall organic molecule
Emp. Form.C9H11NO
Mol. Mass.149.1897
SMILESCCC(=O)c1ccc(N)cc1