Reaction Details
Target5-hydroxytryptamine receptor 5A
LigandBDBM9019
Substrate/Competitorn/a
Ki 1000±n/a nM
CommentsPDSP_1189
Citation Erlander, MGLovenberg, TWBaron, BMde Lecea, LDanielson, PERacke, MSlone, ALSiegel, BWFoye, PECannon, K Two members of a distinct subfamily of 5-hydroxytryptamine receptors differentially expressed in rat brain. Proc Natl Acad Sci U S A90:3452-6 (1993) 
 
5-hydroxytryptamine receptor 5A
Name:5-hydroxytryptamine receptor 5A
Type:Enzyme Catalytic Domain
Mol. Mass.:40684.21
Organism:RAT
Description:5-HT5a HTR5A RAT::P35364
Residue:357
BDBM9019
NameBDBM9019
Synonyms:CHEMBL45 N-[2-(5-methoxy-1H-indol-3-yl)ethyl]acetamide
TypeSmall organic molecule
Emp. Form.C13H16N2O2
Mol. Mass.232.2783
SMILESCOc1ccc2[nH]cc(CCNC(C)=O)c2c1