Reaction Details
Target5-hydroxytryptamine receptor 5B
LigandBDBM28582
Substrate/Competitorn/a
Ki 1000±n/a nM
CommentsPDSP_719
Citation Erlander, MGLovenberg, TWBaron, BMde Lecea, LDanielson, PERacke, MSlone, ALSiegel, BWFoye, PECannon, K Two members of a distinct subfamily of 5-hydroxytryptamine receptors differentially expressed in rat brain. Proc Natl Acad Sci U S A90:3452-6 (1993) 
 
5-hydroxytryptamine receptor 5B
Name:5-hydroxytryptamine receptor 5B
Type:Enzyme Catalytic Domain
Mol. Mass.:41141.95
Organism:RAT
Description:5-HT5B 0 RAT::P35365
Residue:370
BDBM28582
NameBDBM28582
Synonyms:1-(4-iodo-2,5-dimethoxyphenyl)propan-2-amine DOI DOI,(-) [125I]4-iodo-2,5-dimethoxyphenylisopropylamine | [125I]DOI
Typeradiolabeled ligand
Emp. Form.C11H16INO2
Mol. Mass.321.1547
SMILESCOc1cc(CC(C)N)c(OC)cc1I