Reaction Details
Target5-hydroxytryptamine receptor 5B
LigandBDBM50031942
Substrate/Competitorn/a
Ki 195.6±n/a nM
CommentsPDSP_1230
Citation Erlander, MGLovenberg, TWBaron, BMde Lecea, LDanielson, PERacke, MSlone, ALSiegel, BWFoye, PECannon, K Two members of a distinct subfamily of 5-hydroxytryptamine receptors differentially expressed in rat brain. Proc Natl Acad Sci U S A90:3452-6 (1993) 
 
5-hydroxytryptamine receptor 5B
Name:5-hydroxytryptamine receptor 5B
Type:Enzyme Catalytic Domain
Mol. Mass.:41141.95
Organism:RAT
Description:5-HT5B 0 RAT::P35365
Residue:370
BDBM50031942
NameBDBM50031942
Synonyms:(6aR,9R)-4,6a,7-Trimethyl-4,6,6a,7,8,9-hexahydro-indolo[4,3-fg]quinoline-9-carboxylic acid (1-hydroxymethyl-propyl)-amide (6aR,9R)-4-Methyl-4,6,6a,7,8,9-hexahydro-indolo[4,3-fg]quinoline-9-carboxylic acid (1-hydroxymethyl-propyl)-amide (methylsergide)4,7-Dimethyl-4,6,6a,7,8,9-hexahydro-indolo[4,3-fg]quinoline-9-carboxylic acid (1-hydroxymethyl-propyl)-amide CHEMBL1065 Sansert
TypeSmall organic molecule
Emp. Form.C21H27N3O2
Mol. Mass.353.458
SMILESCC[C@@H](CO)NC(=O)[C@H]1CN(C)[C@@H]2Cc3cn(C)c4cccc(C2=C1)c34